'make install' error

classic Classic list List threaded Threaded
1 message Options
Reply | Threaded
Open this post in threaded view
|

'make install' error

bobroff@centrum.is
CVS ChangeLog 1.4371

'make all' seemed to go well.

'make install' barfed:

Traceback (most recent call last):
  File "/usr/src/lilypond/stepmake/bin/install.py", line 69, in ?
    os.makedirs (f, mode=mode)
  File "/usr/lib/python2.3/os.py", line 154, in makedirs
    mkdir(name, mode)
OSError: [Errno 17] File exists: '/'
fc-
cache  /usr/local/share/lilypond/2.7.25/tex  /usr/local/share/lilypond/2.7.25/fonts/otf  /usr/local/share/lilypond/2.7.25/fonts/tfm  /usr/local/share/lilypond/2.7.25/fonts/type1  /usr/local/share/lilypond/2.7.25/ps/    /usr/local/share/lilypond/2.7.25/fonts/svg
d /usr/local/share/lilypond/2.7.25/dvips
make[1]: d: Command not found
make[1]: [local-install] Error 127 (ignored)
(cd /usr/local/share/lilypond/2.7.25/dvips && ln -sf ../fonts/map .)
/bin/sh: line 0: cd: /usr/local/share/lilypond/2.7.25/dvips: No such
file or directory
make[1]: *** [local-install] Error 1
make[1]: Leaving directory `/usr/src/lilypond/mf'
make: *** [install] Error 2
[root@dhcppc1 lilypond]#

-David
Fedora Core 3



_______________________________________________
lilypond-devel mailing list
[hidden email]
http://lists.gnu.org/mailman/listinfo/lilypond-devel