'make all' fails

classic Classic list List threaded Threaded
1 message Options
Reply | Threaded
Open this post in threaded view
|

'make all' fails

bobroff@centrum.is
At 'make all' my machine bailed out trying to compile latest CVS
(ChangeLog 1.4617).

all-font-metrics.cc: At global scope:
all-font-metrics.cc:61: error:
`Pango_font*All_font_metrics::find_pango_font' is not a static member of
`class All_font_metrics'
all-font-metrics.cc:61: error: `PangoFontDescription' was not declared
in this scope
all-font-metrics.cc:61: error: `description' was not declared in this
scope
all-font-metrics.cc:62: error: expected primary-expression before
"magnification"
all-font-metrics.cc:63: error: expected primary-expression before
"output_scale"all-font-metrics.cc:65: error: initializer expression list
treated as compound expression
all-font-metrics.cc:65: error: expected `,' or `;' before '{' token
make[1]: *** [out/all-font-metrics.o] Error 1
make[1]: Leaving directory `/usr/src/lilypond/lily'
make: *** [all] Error 2
[root@dhcppc1 lilypond]#

-David



_______________________________________________
lilypond-devel mailing list
[hidden email]
http://lists.gnu.org/mailman/listinfo/lilypond-devel