latest make all fails

classic Classic list List threaded Threaded
4 messages Options
Reply | Threaded
Open this post in threaded view
|

latest make all fails

Paul Scott-3
Compiling fdl.texi...
Writing `fdl.texi'...
lilypond-book.py: warning: option --psfonts not used
lilypond-book.py: warning: processing with dvips will have no fonts

DVIPS usage:
    dvips -h ./out/lilypond.psfonts ./out/lilypond.dvi
mv -f ./out/lilypond.texinfo out/lilypond.nexi 2>/dev/null || mv -f
./out/lilypond.texi out/lilypond.nexi
LANG= makeinfo  --enable-encoding -I ./out --output=./out/lilypond.info
out/lilypond.nexi
out/lilypond.nexi:177: warning: unrecognized encoding name `utf-8'.
/home/paul/lilypond/Documentation/user/out//instrument-notation.texi:1265:
Misplaced {.
/home/paul/lilypond/Documentation/user/out//instrument-notation.texi:1266:
Misplaced {.
/home/paul/lilypond/Documentation/user/out//instrument-notation.texi:1271:
Misplaced }.
/home/paul/lilypond/Documentation/user/out//instrument-notation.texi:1272:
Misplaced }.
/home/paul/lilypond/Documentation/user/out//programming-interface.texi:100:
Misplaced {.
/home/paul/lilypond/Documentation/user/out//programming-interface.texi:100:
Misplaced }.
makeinfo: Removing output file `./out/lilypond.info' due to errors; use
--force to preserve.
make[2]: *** [out/lilypond.info] Error 1
make[2]: Leaving directory `/home/paul/lilypond/Documentation/user'
make[1]: *** [all] Error 2
make[1]: Leaving directory `/home/paul/lilypond/Documentation'
make: *** [all] Error 2



_______________________________________________
lilypond-devel mailing list
[hidden email]
http://lists.gnu.org/mailman/listinfo/lilypond-devel
Reply | Threaded
Open this post in threaded view
|

Re: latest make all fails

Graham Percival-2

On 19-Feb-06, at 12:46 PM, Paul Scott wrote:

> /home/paul/lilypond/Documentation/user/out//instrument-notation.texi:
> 1265: Misplaced {.
> /home/paul/lilypond/Documentation/user/out//instrument-notation.texi:
> 1266: Misplaced {.
> /home/paul/lilypond/Documentation/user/out//instrument-notation.texi:
> 1271: Misplaced }.
> /home/paul/lilypond/Documentation/user/out//instrument-notation.texi:
> 1272: Misplaced }.
> /home/paul/lilypond/Documentation/user/out//programming-
> interface.texi:100: Misplaced {.
> /home/paul/lilypond/Documentation/user/out//programming-
> interface.texi:100: Misplaced }.

Fixed in CVS, thanks.

- Graham



_______________________________________________
lilypond-devel mailing list
[hidden email]
http://lists.gnu.org/mailman/listinfo/lilypond-devel
Reply | Threaded
Open this post in threaded view
|

Re: latest make all fails

Paul Scott-3
Graham Percival wrote:

>
> On 19-Feb-06, at 12:46 PM, Paul Scott wrote:
>
>> /home/paul/lilypond/Documentation/user/out//instrument-notation.texi:
>> 1265: Misplaced {.
>> /home/paul/lilypond/Documentation/user/out//instrument-notation.texi:
>> 1266: Misplaced {.
>
>
> Fixed in CVS, thanks.

Thanks, the latest (ChangeLog 1.4653) builds and installs fine.

Now 'make web' gives (there are more errors before this):

/home/paul/lilypond/Documentation/user/out-www/lily-242571775.ly:275:19:
error: syntax error, unexpected STRING
      \new Staff =
                   "bass" \bass]]
error: failed files: "lily-242571775 lily-1888003085 lily-214162626
lily-1857873103"
lilypond-book.py: warning: `lilypond' failed (status 1) (ignored)

lilypond-book.py: error: Process /home/paul/lilypond/lily/out/lilypond
--verbose --backend=eps --formats=ps,png --header=texidoc -I
/home/paul/lilypond/input/test -dinternal-type-checking
-danti-alias-factor=2 -dgs-font-load -I  
'/home/paul/lilypond/Documentation/user'  -I  
'/home/paul/lilypond/Documentation/user'  -I  
'/home/paul/lilypond/Documentation/user/out-www'  -I  
'/home/paul/lilypond/input'  -I  '/home/paul/lilypond/input/regression'  
-I  '/home/paul/lilypond/input/test'  -I  
'/home/paul/lilypond/input/tutorial'  -I  '/home/paul/lilypond/mf/out'  
-I  '/home/paul/lilypond/mf/out' snippet-map.ly lily-51010512
lily-102219562 lily-1696771401 lily-1864761778 lily-1054314441
lily-890200228 lily-1857873103 lily-576854381 lily-214162626
lily-1888003085 lily-242571775 exited unsuccessfully.
Removing `examples.texi'
Removing `lilypond.texi'
Traceback (most recent call last):
  File "../../scripts/lilypond-book.py", line 1694, in ?
    main ()
  File "../../scripts/lilypond-book.py", line 1677, in main
    ly.exit (1)
  File
"/home/paul/lilypond/out/share/lilypond/current/python/lilylib.py", line
86, in exit
    raise _ ('Exiting (%d)...') % i
Exiting (1)...
make[3]: *** [out-www/lilypond.texi] Error 1
make[3]: Leaving directory `/home/paul/lilypond/Documentation/user'
make[2]: *** [WWW] Error 2
make[2]: Leaving directory `/home/paul/lilypond/Documentation'
make[1]: *** [WWW] Error 2
make[1]: Leaving directory `/home/paul/lilypond'
make: *** [web] Error 2

Paul




_______________________________________________
lilypond-devel mailing list
[hidden email]
http://lists.gnu.org/mailman/listinfo/lilypond-devel
Reply | Threaded
Open this post in threaded view
|

Re: latest make all fails

Graham Percival-2

On 19-Feb-06, at 11:12 PM, Paul Scott wrote:

> Now 'make web' gives (there are more errors before this):
>
> /home/paul/lilypond/Documentation/user/out-www/lily-242571775.ly:275:
> 19: error: syntax error, unexpected STRING
>      \new Staff =
>                   "bass" \bass]]
> error: failed files: "lily-242571775 lily-1888003085 lily-214162626  
> lily-1857873103"
> lilypond-book.py: warning: `lilypond' failed (status 1) (ignored)

Hmm.  I have no idea what's wrong with this;
\new Staff = "foo"
should be allowable now.  Do you have an old version of lilypond that's  
getting called instead?

- Graham



_______________________________________________
lilypond-devel mailing list
[hidden email]
http://lists.gnu.org/mailman/listinfo/lilypond-devel